{"text_format":"1","workbook":"xlsx","n_sheets":9,"sheets":["Thisworkbook.Names","Custom Shortcuts","Win & Mac Shortcuts table","Excel Shortcuts","Custom_Theme","Misc","Link Format Exceptions","Capitalised Word Exceptions","Settings"],"not_rendered":{"charts":0,"images":1,"macros":1,"external_links":0,"defined_names":107,"comments":1,"pivot_tables":0},"unopened":[],"bounds":{"document_bytes":16777216,"sheet_cells":100000,"rows_first":2000,"rows_last":500,"rows_between":2000,"halvings":0,"cell_chars":16384,"cell_head_chars":4096},"cells_cut":0,"cells_raw":0,"read":"whole","date_system":"1900"}

{"sheet":"Thisworkbook.Names","index":0,"n_rows":109,"n_cols":5,"rows_kept":109,"cut":false,"hidden":false,"merged":[]}
["2022-04-01T12:40:53","Name","RefersTo","Visible","Comment"]
[null,"'Custom Shortcuts'!_FilterDatabase","='Custom Shortcuts'!$B$14:$AZJ$103",false,""]
[null,"_xlfn.XLOOKUP","=#NAME?",false,""]
[null,"AutoFormatting","=Misc!$D$7",true,""]
[null,"bMacrosRun","=Misc!$D$6",true,""]
[null,"bRebindKeysOnFirstInvoke","=Misc!$D$5",true,""]
[null,"bTestMode","=Misc!$D$3",true,""]
[null,"CASmodifiers","=Misc!$F$3:$F$6",true,""]
[null,"cf_AddChangeLog","='Custom Shortcuts'!$G$25",true,""]
[null,"cf_AddSparkline","='Custom Shortcuts'!$G$33",true,""]
[null,"cf_Anchoring","='Custom Shortcuts'!$G$21",true,""]
[null,"cf_Black","='Custom Shortcuts'!$G$60",true,""]
[null,"cf_Border","='Custom Shortcuts'!$G$63",true,""]
[null,"cf_Brackets","='Custom Shortcuts'!$G$64",true,""]
[null,"cf_ChangeColours","='Custom Shortcuts'!$G$28",true,""]
[null,"cf_ClearFill","='Custom Shortcuts'!$G$49",true,""]
[null,"cf_CollapseGroup","='Custom Shortcuts'!$G$71",true,""]
[null,"cf_CopyAcross","='Custom Shortcuts'!$G$16",true,""]
[null,"cf_CounterflowFill","='Custom Shortcuts'!$G$53",true,""]
[null,"cf_CreateOutputTrack","='Custom Shortcuts'!$G$29",true,""]
{"$rows_left_out":90}
{"sheet":"Custom Shortcuts","index":1,"n_rows":103,"n_cols":14,"rows_kept":103,"cut":false,"hidden":false,"merged":[]}
[]
[]
[null,null,null,null,"Version 020a 01-Apr-22"]
[null,null,null,null,"If you are using a Mac, the Ctrl + Alt + Shift commands are invoked using "]
[null,null,null,null,"Ctrl + Option + Shift (hold Option down a little longer and release it last)"]
[null,null,null,null,"Option is the \"⌥\" key."]
[]
["Introduction"]
[null,null,"The range with the bold outside border is named Custom_Shortcuts_table.\nPlease edit, insert, or delete within that range."]
[null,null,null,null,null,null,null,null,null,null,{"$f":" IF(K11 = \"\", 0, 1)","v":0},{"$f":" IF(L11 = \"\", 0, 1)","v":0},{"$f":" IF(M11 = \"\", 0, 1)","v":0}]
[null,null,"Calculation setting to use when file opened",null,null,"Manual",null,{"$f":" IF( ISERR(SUM(K10:M10)), 1, SUM(K10:M10))","v":0},null,null,{"$f":" IF( SUM(K15:K71)=0, \"\", IF(  SUM(K15:K71)=1,  \"There is \" & SUM($K$15:$K$71) & \" keyboard shortcut error\",   \"There are \" & SUM($K$15:$K$71) & \" keyboard shortcut errors\" ) )","v":""},{"$f":" IF( SUM($L$15:$L$71) > 0, \"Duplicate shortcuts combinations used\",\"\")","v":""},{"$f":" IF( SUM($M$15:$M$71) > 0, \"Missing Modifiers\",\"\")","v":""}]
[null,null,"Current Operating system version",null,{"$f":"INFO(\"OSVERSION\")","v":"Windows (32-bit) NT 10.00"},null,null,null,null,null,"Check","Check","Check","Check"]
["Utilities",null,"Name of Mac modifier key",null,"Option"]
["range name \"Custom_Shortcuts_Table\" is A15:G76","Macro","Action","Keyboard Shortcut","Mac Modifier Key(s)","Win Modifier Key(s)","Custom Key",null,null,"Mnemonic","Shortcut 1 character check","Duplicate bind keys","Modifier check","Excel shortcut check"]
["mFAST_v001","QuickLink","Quick Link",{"$f":"IF(LEFT(OSVersion,3)=\"Mac\", E15,F15) & \" \" & G15","v":"Ctrl + Shift + Q"},{"$f":"IF( F15=\"Ctrl + Alt +\",\"Ctrl + \" & $E$13 & \" + Shift +\",F15&\"\")","v":"Ctrl + Shift +"},"Ctrl + Shift +","Q",null,null,"Q for Quick link",{"$f":" IF(LEN(G15)<>1, 1, 0)","v":0},{"$f":" IF(COUNTIF($D$14:$D14, $D15) = 0, 0, 1)","v":0},{"$f":"ISERROR(MATCH(F15,CASmodifiers,0))*1","v":0},{"$f":"_xlfn.XLOOKUP(SUBSTITUTE(D15,\" \",\"\"),ExcelShortcuts[Shortcut],ExcelShortcuts[Value],\"\",0)","v":0}]
["mFAST_v001","CopyAcross","Copy Across","Ctrl + Shift + A",{"$f":"IF( F16=\"Ctrl + Alt +\",\"Ctrl + \" & $E$13 & \" + Shift +\",F16&\"\")","v":"Ctrl + Shift +"},"Ctrl + Shift +","A",null,null,"A for Copy Across",0,{"$f":" IF(COUNTIF($D$14:$D15, $D16) = 0, 0, 1)","v":0},0,{"$f":"_xlfn.XLOOKUP(SUBSTITUTE(D16,\" \",\"\"),ExcelShortcuts[Shortcut],ExcelShortcuts[Value],\"\",0)","v":"Insert arguments in formula"}]
["mFAST_v001","RowSummation","Sum Across","Ctrl + Shift + N","Ctrl + Shift +","Ctrl + Shift +","N",null,null,"N for SummatioN",0,{"$f":" IF(COUNTIF($D$14:$D16, $D17) = 0, 0, 1)","v":0},0,{"$f":"_xlfn.XLOOKUP(SUBSTITUTE(D17,\" \",\"\"),ExcelShortcuts[Shortcut],ExcelShortcuts[Value],\"\",0)","v":""}]
["mFAST_v001","RelocateInput","Relocate Inputs","Ctrl + Alt + R","Ctrl + Option + Shift +","Ctrl + Alt +","R",null,null,"R for Relocate inputs",0,{"$f":" IF(COUNTIF($D$14:$D17, $D18) = 0, 0, 1)","v":0},0,{"$f":"_xlfn.XLOOKUP(SUBSTITUTE(D18,\" \",\"\"),ExcelShortcuts[Shortcut],ExcelShortcuts[Value],\"\",0)","v":""}]
["mFAST_v001","RelocateOutput","Relocate Outputs","Ctrl + Alt + O","Ctrl + Option + Shift +","Ctrl + Alt +","O",null,null,null,0,{"$f":" IF(COUNTIF($D$14:$D18, $D19) = 0, 0, 1)","v":0},0,{"$f":"_xlfn.XLOOKUP(SUBSTITUTE(D19,\" \",\"\"),ExcelShortcuts[Shortcut],ExcelShortcuts[Value],\"\",0)","v":""}]
["mFAST_v001","FAST_Placeholders","Placeholders List with comments","Ctrl + Alt + P","Ctrl + Option + Shift +","Ctrl + Alt +","P",null,null,"P for Placeholder list",0,{"$f":" IF(COUNTIF($D$14:$D19, $D20) = 0, 0, 1)","v":0},0,{"$f":"_xlfn.XLOOKUP(SUBSTITUTE(D20,\" \",\"\"),ExcelShortcuts[Shortcut],ExcelShortcuts[Value],\"\",0)","v":""}]
{"$rows_left_out":84}
{"sheet":"Win & Mac Shortcuts table","index":2,"n_rows":244,"n_cols":6,"rows_kept":244,"cut":false,"hidden":false,"merged":[]}
["Action","WinKB","MacKB","Win","Mac","Although not documented, Ctrl+key in Mac usually works the same as Cmd+key.\nExcept for Cmd+H (Finder:Hide window)"]
["Create new workbook","CtrlN","⌘N","Ctrl+N","Cmd+N","UNICODE(\"⌘\") = 8984"]
["Open workbook","CtrlO","⌘O","Ctrl+O","Cmd+O","UNICODE(\"⇧\") = 8679"]
["Save workbook","CtrlS","⌘S","Ctrl+S","Cmd+S","UNICODE(\"⌃\") = 8963"]
["Save as","F12","⌘⇧S","F12","Cmd+Shift+S","Cmd+Shift+s"]
["Print file","CtrlP","⌘P","Ctrl+P","Cmd+P"]
["Open print preview window","CtrlF2","","Ctrl+F2",""]
["Close current workbook","CtrlW","⌘W","Ctrl+W","Cmd+W","Win:Ctrl+F4  (Mac: Activity Monitor)"]
["Close Excel","AltF4","⌘Q","Alt+F4","Cmd+Q"]
["Expand or collapse ribbon","CtrlF1","⌘⌥R","Ctrl+F1","Cmd+Option+R","UNICODE(\"⌥\") = 8997"]
["Activate access keys","Alt","","Alt+",""]
["Move to next ribbon control","Tab","Tab","Tab","Tab"]
["Activate or open selected control","Space","Space","Space","Space"]
["Confirm control change","Enter","Return","Enter","Return"]
["Get help on selected control","F1","","F1",""]
["Open options","AltFT","⌘,","Alt+FT","Cmd+,"]
["Open help","F1","⌘/","F1","Cmd+/"]
["Undo last action","CtrlZ","⌘Z","Ctrl+Z","Cmd+Z"]
["Redo last action","CtrlY","⌘Y","Ctrl+Y","Cmd+Y"]
["Copy selected cells","CtrlC","⌘C","Ctrl+C","Cmd+C"]
{"$rows_left_out":225}
{"sheet":"Excel Shortcuts","index":3,"n_rows":524,"n_cols":6,"rows_kept":524,"cut":false,"hidden":false,"merged":[]}
["Key","Attribute","Value","Shortcut","Gridlines","Check"]
["F1","Alone","Help",{"$f":"IF(ExcelShortcuts[[#This Row],[Attribute]]=\"Alone\",\"\",ExcelShortcuts[[#This Row],[Attribute]]&\"+\")&ExcelShortcuts[[#This Row],[Key]]","v":"F1"},{"$f":"_xlfn.XLOOKUP(SUBSTITUTE(ExcelShortcuts[[#This Row],[Shortcut]],\"+\",\" + \"),'Custom Shortcuts'!$D$15:$D$103,'Custom Shortcuts'!$C$15:$C$103,\"\",0)","v":""},{"$f":"COUNTIF(ExcelShortcuts[Key],\"=\"&ExcelShortcuts[[#This Row],[Key]])","v":8}]
["F1","Shift","What Is… (Help)",{"$f":"IF(ExcelShortcuts[[#This Row],[Attribute]]=\"Alone\",\"\",ExcelShortcuts[[#This Row],[Attribute]]&\"+\")&ExcelShortcuts[[#This Row],[Key]]","v":"Shift+F1"},{"$f":"_xlfn.XLOOKUP(SUBSTITUTE(ExcelShortcuts[[#This Row],[Shortcut]],\"+\",\" + \"),'Custom Shortcuts'!$D$15:$D$103,'Custom Shortcuts'!$C$15:$C$103,\"\",0)","v":""},{"$f":"COUNTIF(ExcelShortcuts[Key],\"=\"&ExcelShortcuts[[#This Row],[Key]])","v":8}]
["F1","Ctrl","Excel 2007: Show / Hide Ribbon; Excel 2003: Show / Hide Task Pane",{"$f":"IF(ExcelShortcuts[[#This Row],[Attribute]]=\"Alone\",\"\",ExcelShortcuts[[#This Row],[Attribute]]&\"+\")&ExcelShortcuts[[#This Row],[Key]]","v":"Ctrl+F1"},{"$f":"_xlfn.XLOOKUP(SUBSTITUTE(ExcelShortcuts[[#This Row],[Shortcut]],\"+\",\" + \"),'Custom Shortcuts'!$D$15:$D$103,'Custom Shortcuts'!$C$15:$C$103,\"\",0)","v":""},{"$f":"COUNTIF(ExcelShortcuts[Key],\"=\"&ExcelShortcuts[[#This Row],[Key]])","v":8}]
["F1","Alt","Excel 2007: Insert Chart as Object; Excel 2003: Insert Chart as Sheet",{"$f":"IF(ExcelShortcuts[[#This Row],[Attribute]]=\"Alone\",\"\",ExcelShortcuts[[#This Row],[Attribute]]&\"+\")&ExcelShortcuts[[#This Row],[Key]]","v":"Alt+F1"},{"$f":"_xlfn.XLOOKUP(SUBSTITUTE(ExcelShortcuts[[#This Row],[Shortcut]],\"+\",\" + \"),'Custom Shortcuts'!$D$15:$D$103,'Custom Shortcuts'!$C$15:$C$103,\"\",0)","v":""},{"$f":"COUNTIF(ExcelShortcuts[Key],\"=\"&ExcelShortcuts[[#This Row],[Key]])","v":8}]
["F1","Ctrl+Shift","",{"$f":"IF(ExcelShortcuts[[#This Row],[Attribute]]=\"Alone\",\"\",ExcelShortcuts[[#This Row],[Attribute]]&\"+\")&ExcelShortcuts[[#This Row],[Key]]","v":"Ctrl+Shift+F1"},{"$f":"_xlfn.XLOOKUP(SUBSTITUTE(ExcelShortcuts[[#This Row],[Shortcut]],\"+\",\" + \"),'Custom Shortcuts'!$D$15:$D$103,'Custom Shortcuts'!$C$15:$C$103,\"\",0)","v":""},{"$f":"COUNTIF(ExcelShortcuts[Key],\"=\"&ExcelShortcuts[[#This Row],[Key]])","v":8}]
["F1","Shift+Alt","Insert New Sheet",{"$f":"IF(ExcelShortcuts[[#This Row],[Attribute]]=\"Alone\",\"\",ExcelShortcuts[[#This Row],[Attribute]]&\"+\")&ExcelShortcuts[[#This Row],[Key]]","v":"Shift+Alt+F1"},{"$f":"_xlfn.XLOOKUP(SUBSTITUTE(ExcelShortcuts[[#This Row],[Shortcut]],\"+\",\" + \"),'Custom Shortcuts'!$D$15:$D$103,'Custom Shortcuts'!$C$15:$C$103,\"\",0)","v":""},{"$f":"COUNTIF(ExcelShortcuts[Key],\"=\"&ExcelShortcuts[[#This Row],[Key]])","v":8}]
["F1","Ctrl+Alt","New Macro sheet",{"$f":"IF(ExcelShortcuts[[#This Row],[Attribute]]=\"Alone\",\"\",ExcelShortcuts[[#This Row],[Attribute]]&\"+\")&ExcelShortcuts[[#This Row],[Key]]","v":"Ctrl+Alt+F1"},{"$f":"_xlfn.XLOOKUP(SUBSTITUTE(ExcelShortcuts[[#This Row],[Shortcut]],\"+\",\" + \"),'Custom Shortcuts'!$D$15:$D$103,'Custom Shortcuts'!$C$15:$C$103,\"\",0)","v":""},{"$f":"COUNTIF(ExcelShortcuts[Key],\"=\"&ExcelShortcuts[[#This Row],[Key]])","v":8}]
["F1","Ctrl+Shift+Alt","",{"$f":"IF(ExcelShortcuts[[#This Row],[Attribute]]=\"Alone\",\"\",ExcelShortcuts[[#This Row],[Attribute]]&\"+\")&ExcelShortcuts[[#This Row],[Key]]","v":"Ctrl+Shift+Alt+F1"},{"$f":"_xlfn.XLOOKUP(SUBSTITUTE(ExcelShortcuts[[#This Row],[Shortcut]],\"+\",\" + \"),'Custom Shortcuts'!$D$15:$D$103,'Custom Shortcuts'!$C$15:$C$103,\"\",0)","v":""},{"$f":"COUNTIF(ExcelShortcuts[Key],\"=\"&ExcelShortcuts[[#This Row],[Key]])","v":8}]
["F2","Alone","Toggle Select, Edit and Enter / Point modes",{"$f":"IF(ExcelShortcuts[[#This Row],[Attribute]]=\"Alone\",\"\",ExcelShortcuts[[#This Row],[Attribute]]&\"+\")&ExcelShortcuts[[#This Row],[Key]]","v":"F2"},{"$f":"_xlfn.XLOOKUP(SUBSTITUTE(ExcelShortcuts[[#This Row],[Shortcut]],\"+\",\" + \"),'Custom Shortcuts'!$D$15:$D$103,'Custom Shortcuts'!$C$15:$C$103,\"\",0)","v":""},{"$f":"COUNTIF(ExcelShortcuts[Key],\"=\"&ExcelShortcuts[[#This Row],[Key]])","v":8}]
["F2","Shift","Insert / Edit Comment",{"$f":"IF(ExcelShortcuts[[#This Row],[Attribute]]=\"Alone\",\"\",ExcelShortcuts[[#This Row],[Attribute]]&\"+\")&ExcelShortcuts[[#This Row],[Key]]","v":"Shift+F2"},{"$f":"_xlfn.XLOOKUP(SUBSTITUTE(ExcelShortcuts[[#This Row],[Shortcut]],\"+\",\" + \"),'Custom Shortcuts'!$D$15:$D$103,'Custom Shortcuts'!$C$15:$C$103,\"\",0)","v":""},{"$f":"COUNTIF(ExcelShortcuts[Key],\"=\"&ExcelShortcuts[[#This Row],[Key]])","v":8}]
["F2","Ctrl","Excel 2007: Print; Excel 2003: SHOW.INFO()",{"$f":"IF(ExcelShortcuts[[#This Row],[Attribute]]=\"Alone\",\"\",ExcelShortcuts[[#This Row],[Attribute]]&\"+\")&ExcelShortcuts[[#This Row],[Key]]","v":"Ctrl+F2"},{"$f":"_xlfn.XLOOKUP(SUBSTITUTE(ExcelShortcuts[[#This Row],[Shortcut]],\"+\",\" + \"),'Custom Shortcuts'!$D$15:$D$103,'Custom Shortcuts'!$C$15:$C$103,\"\",0)","v":""},{"$f":"COUNTIF(ExcelShortcuts[Key],\"=\"&ExcelShortcuts[[#This Row],[Key]])","v":8}]
["F2","Alt","Save As",{"$f":"IF(ExcelShortcuts[[#This Row],[Attribute]]=\"Alone\",\"\",ExcelShortcuts[[#This Row],[Attribute]]&\"+\")&ExcelShortcuts[[#This Row],[Key]]","v":"Alt+F2"},{"$f":"_xlfn.XLOOKUP(SUBSTITUTE(ExcelShortcuts[[#This Row],[Shortcut]],\"+\",\" + \"),'Custom Shortcuts'!$D$15:$D$103,'Custom Shortcuts'!$C$15:$C$103,\"\",0)","v":""},{"$f":"COUNTIF(ExcelShortcuts[Key],\"=\"&ExcelShortcuts[[#This Row],[Key]])","v":8}]
["F2","Ctrl+Shift","",{"$f":"IF(ExcelShortcuts[[#This Row],[Attribute]]=\"Alone\",\"\",ExcelShortcuts[[#This Row],[Attribute]]&\"+\")&ExcelShortcuts[[#This Row],[Key]]","v":"Ctrl+Shift+F2"},{"$f":"_xlfn.XLOOKUP(SUBSTITUTE(ExcelShortcuts[[#This Row],[Shortcut]],\"+\",\" + \"),'Custom Shortcuts'!$D$15:$D$103,'Custom Shortcuts'!$C$15:$C$103,\"\",0)","v":""},{"$f":"COUNTIF(ExcelShortcuts[Key],\"=\"&ExcelShortcuts[[#This Row],[Key]])","v":8}]
["F2","Shift+Alt","Save",{"$f":"IF(ExcelShortcuts[[#This Row],[Attribute]]=\"Alone\",\"\",ExcelShortcuts[[#This Row],[Attribute]]&\"+\")&ExcelShortcuts[[#This Row],[Key]]","v":"Shift+Alt+F2"},{"$f":"_xlfn.XLOOKUP(SUBSTITUTE(ExcelShortcuts[[#This Row],[Shortcut]],\"+\",\" + \"),'Custom Shortcuts'!$D$15:$D$103,'Custom Shortcuts'!$C$15:$C$103,\"\",0)","v":""},{"$f":"COUNTIF(ExcelShortcuts[Key],\"=\"&ExcelShortcuts[[#This Row],[Key]])","v":8}]
["F2","Ctrl+Alt","Open",{"$f":"IF(ExcelShortcuts[[#This Row],[Attribute]]=\"Alone\",\"\",ExcelShortcuts[[#This Row],[Attribute]]&\"+\")&ExcelShortcuts[[#This Row],[Key]]","v":"Ctrl+Alt+F2"},{"$f":"_xlfn.XLOOKUP(SUBSTITUTE(ExcelShortcuts[[#This Row],[Shortcut]],\"+\",\" + \"),'Custom Shortcuts'!$D$15:$D$103,'Custom Shortcuts'!$C$15:$C$103,\"\",0)","v":""},{"$f":"COUNTIF(ExcelShortcuts[Key],\"=\"&ExcelShortcuts[[#This Row],[Key]])","v":8}]
["F2","Ctrl+Shift+Alt","Print",{"$f":"IF(ExcelShortcuts[[#This Row],[Attribute]]=\"Alone\",\"\",ExcelShortcuts[[#This Row],[Attribute]]&\"+\")&ExcelShortcuts[[#This Row],[Key]]","v":"Ctrl+Shift+Alt+F2"},{"$f":"_xlfn.XLOOKUP(SUBSTITUTE(ExcelShortcuts[[#This Row],[Shortcut]],\"+\",\" + \"),'Custom Shortcuts'!$D$15:$D$103,'Custom Shortcuts'!$C$15:$C$103,\"\",0)","v":""},{"$f":"COUNTIF(ExcelShortcuts[Key],\"=\"&ExcelShortcuts[[#This Row],[Key]])","v":8}]
["F3","Alone","Paste Names",{"$f":"IF(ExcelShortcuts[[#This Row],[Attribute]]=\"Alone\",\"\",ExcelShortcuts[[#This Row],[Attribute]]&\"+\")&ExcelShortcuts[[#This Row],[Key]]","v":"F3"},{"$f":"_xlfn.XLOOKUP(SUBSTITUTE(ExcelShortcuts[[#This Row],[Shortcut]],\"+\",\" + \"),'Custom Shortcuts'!$D$15:$D$103,'Custom Shortcuts'!$C$15:$C$103,\"\",0)","v":""},{"$f":"COUNTIF(ExcelShortcuts[Key],\"=\"&ExcelShortcuts[[#This Row],[Key]])","v":8}]
["F3","Shift","Function Wizard",{"$f":"IF(ExcelShortcuts[[#This Row],[Attribute]]=\"Alone\",\"\",ExcelShortcuts[[#This Row],[Attribute]]&\"+\")&ExcelShortcuts[[#This Row],[Key]]","v":"Shift+F3"},{"$f":"_xlfn.XLOOKUP(SUBSTITUTE(ExcelShortcuts[[#This Row],[Shortcut]],\"+\",\" + \"),'Custom Shortcuts'!$D$15:$D$103,'Custom Shortcuts'!$C$15:$C$103,\"\",0)","v":""},{"$f":"COUNTIF(ExcelShortcuts[Key],\"=\"&ExcelShortcuts[[#This Row],[Key]])","v":8}]
["F3","Ctrl","Excel 2007: Open Name Manager; Excel 2003: Open Define Names Dialog Box",{"$f":"IF(ExcelShortcuts[[#This Row],[Attribute]]=\"Alone\",\"\",ExcelShortcuts[[#This Row],[Attribute]]&\"+\")&ExcelShortcuts[[#This Row],[Key]]","v":"Ctrl+F3"},{"$f":"_xlfn.XLOOKUP(SUBSTITUTE(ExcelShortcuts[[#This Row],[Shortcut]],\"+\",\" + \"),'Custom Shortcuts'!$D$15:$D$103,'Custom Shortcuts'!$C$15:$C$103,\"\",0)","v":""},{"$f":"COUNTIF(ExcelShortcuts[Key],\"=\"&ExcelShortcuts[[#This Row],[Key]])","v":8}]
{"$rows_left_out":505}
{"sheet":"Custom_Theme","index":4,"n_rows":20,"n_cols":2,"rows_kept":20,"cut":false,"hidden":false,"merged":[]}
["Name of theme","Financial_Model"]
[]
["Text/Background - Dark 1"]
["Text/Background - Light 1"]
["Text/Background - Dark 2"]
["Text/Background - Light 2"]
["Accent 1"]
["Accent 2"]
["Accent 3"]
["Accent 4"]
["Accent 5"]
["Accent 6"]
["Hyperlink"]
["Followed Hyperlink"]
[]
[]
["Custom Fonts name","Financial_Model"]
[]
["Heading Font","Example"]
["Body Font","Example"]
{"$rows_left_out":1}
{"sheet":"Misc","index":5,"n_rows":25,"n_cols":6,"rows_kept":25,"cut":false,"hidden":false,"merged":[]}
[]
[null,null,null,null,null,"Short Cut Key Combination Modifiers Drop Down List"]
[null,null,"Test Mode",false,null,"Ctrl +"]
[null,null,null,null,null,"Ctrl + Shift +"]
[null,null,"Rebind keys on 1st macro run",true,null,"Ctrl + Alt +"]
[null,null,"Macros Run",false,null,"Ctrl + Alt + Shift +"]
[null,null,"Auto Formatting",true]
[null,null,"Show variances on userform",false]
[null,null,"Create Variance % tab when creating other variance tabs",false]
[]
[]
[null,null,"Maximum rows in Variance report",15000]
[null,null,"Maximum columns in Variance report",1000]
[]
[null,null,"SPARKLINES (default Line style applied)"]
[null,null,"Colour of line",12566463]
[null,null,"Weight of line in points",0.5]
[null,null,"Start column","J"]
[null,null,"End column (if blank, defaults to last used column)"]
[]
{"$rows_left_out":6}
{"sheet":"Link Format Exceptions","index":6,"n_rows":9,"n_cols":3,"rows_kept":9,"cut":false,"hidden":false,"merged":[]}
["Sheets to not change","Export Exception","Import Exception"]
["Change",false,false]
["FinStat",true,true]
["FS",true,true]
["FSAnn",true,true]
["InpC",true,true]
["InpS",true,true]
["InpS_M",true,true]
["Tmp",true,true]

{"sheet":"Capitalised Word Exceptions","index":7,"n_rows":55,"n_cols":1,"rows_kept":55,"cut":false,"hidden":false,"merged":[]}
["Sheets to not change"]
[" POS"]
["(Som)"]
["AEP"]
["AR/AP"]
["BEG"]
["BOP costs"]
["COD"]
["CRCC"]
["DSCR"]
["DSRA"]
["EBIT"]
["EBITDA"]
["EBL"]
["EGR"]
["EGR"]
["EGRs"]
["EPC"]
["EWEC"]
["FC"]
{"$rows_left_out":36}
{"sheet":"Settings","index":8,"n_rows":7,"n_cols":4,"rows_kept":7,"cut":false,"hidden":false,"merged":[]}
[null,"Column Number","Column Letter","Error Check"]
["Label Column",5,"E",{"$f":"IF(COLUMN(INDIRECT(C2&1))<>B2,\"Number and Letter do not match\",\"\")","v":""}]
["Units Column",7,"G",{"$f":"IF(COLUMN(INDIRECT(C3&1))<>B3,\"Number and Letter do not match\",\"\")","v":""}]
["Constant Column",6,"F",{"$f":"IF(COLUMN(INDIRECT(C4&1))<>B4,\"Number and Letter do not match\",\"\")","v":""}]
["Query Column",5,"E",{"$f":"IF(COLUMN(INDIRECT(C5&1))<>B5,\"Number and Letter do not match\",\"\")","v":""}]
["Time series start",10,"J",{"$f":"IF(COLUMN(INDIRECT(C6&1))<>B6,\"Number and Letter do not match\",\"\")","v":""}]
["Totals column",8,"H",{"$f":"IF(COLUMN(INDIRECT(C7&1))<>B7,\"Number and Letter do not match\",\"\")","v":""}]